fpkm,id,response,Tumor Type,genesymbol,genesymbol_ref,mut_aa_pos,wt_peptide,wt_aa,mut_dna,mut_peptide,mut_aa,antigen_len,locus,alleleA,alleleB,APC_type,antigen_type,minimal_peptide,Tcell_source,assay,sampleid,PMID,journal,title,date,blockade,ACT,vaccination,curative_effect,numpep,wt_pep_start,mut_pos_in_pep,num_mm,num_gap,pep2aln,protein_sequence,TRAV,TRAJ,CDR3A,TRBV,TRBD,TRBJ,CDR3B
,1,N,Colorectal cancer,C1orf159,C1orf159,106,SSGTPGRPHPGAPRVAASLFLGTFF,P,c.C317T,SSGTPGRPHPGALRVAASLFLGTFF,L,25,A,A*02:01,,DSs,TMG,SSGTPGRPHPGALRVAASLFLGTFF,TILs,ELISPOT,4196,30709841,Cancer Immunol Res,Immunologic Recognition of a Shared p53 Mutated Neoantigen in a Patient with Metastatic Colorectal Cancer,2019,,,,,1,94,13,1,0,"""SSGTPGRPHPGAPRVAASLFLGTFF	||||||||||||.||||||||||||	SSGTPGRPHPGALRVAASLFLGTFF""",MALRHLALLAGLLVGVASKSMENTAQLPECCVDVVGVNASCPGASLCGPGCYRRWNADGSASCVRCGNGTLPAYNGSECRSFAGPGAPFPMNRSSGTPGRPHPGAPRVAASLFLGTFFISSGLILSVAGFFYLKRSSKLPRACYRRNKAPALQPGEAAAMIPPPQSSVRKPRYVRRERPLDRATDPAAFPGEARISNV,,,,,,,
,2,N,Colorectal cancer,C1orf159,C1orf159,106,SSGTPGRPHPGAPRVAASLFLGTFF,P,c.C317T,SSGTPGRPHPGALRVAASLFLGTFF,L,25,A,A*24:01,,DSs,TMG,SSGTPGRPHPGALRVAASLFLGTFF,TILs,ELISPOT,4196,30709841,Cancer Immunol Res,Immunologic Recognition of a Shared p53 Mutated Neoantigen in a Patient with Metastatic Colorectal Cancer,2019,,,,,1,94,13,1,0,"""SSGTPGRPHPGAPRVAASLFLGTFF	||||||||||||.||||||||||||	SSGTPGRPHPGALRVAASLFLGTFF""",MALRHLALLAGLLVGVASKSMENTAQLPECCVDVVGVNASCPGASLCGPGCYRRWNADGSASCVRCGNGTLPAYNGSECRSFAGPGAPFPMNRSSGTPGRPHPGAPRVAASLFLGTFFISSGLILSVAGFFYLKRSSKLPRACYRRNKAPALQPGEAAAMIPPPQSSVRKPRYVRRERPLDRATDPAAFPGEARISNV,,,,,,,
,3,N,Colorectal cancer,MED13L,MED13L,795,VRQDNAAGRAGSSSLTQVTDLAPSL,S,c.G2384A,VRQDNAAGRAGSNSLTQVTDLAPSL,N,25,A,A*02:01,,DSs,TMG,VRQDNAAGRAGSNSLTQVTDLAPSL,TILs,ELISPOT,4196,30709841,Cancer Immunol Res,Immunologic Recognition of a Shared p53 Mutated Neoantigen in a Patient with Metastatic Colorectal Cancer,2019,,,,,1,783,13,1,0,"""VRQDNAAGRAGSSSLTQVTDLAPSL	||||||||||||.||||||||||||	VRQDNAAGRAGSNSLTQVTDLAPSL""",MTAAANWVANGASLEDCHSNLFSLAELTGIKWRRYNFGGHGDCGPIISAPAQDDPILLSFIRCLQANLLCVWRRDVKPDCKELWIFWWGDEPNLVGVIHHELQVVEEGLWENGLSYECRTLLFKAIHNLLERCLMDKNFVRIGKWFVRPYEKDEKPVNKSEHLSCAFTFFLHGESNVCTSVEIAQHQPIYLINEEHIHMAQSSPAPFQVLVSPYGLNGTLTGQAYKMSDPATRKLIEEWQYFYPMVLKKKEESKEEDELGYDDDFPVAVEVIVGGVRMVYPSAFVLISQNDIPVPQSVASAGGHIAVGQQGLGSVKDPSNCGMPLTPPTSPEQAILGESGGMQSAASHLVSQDGGMITMHSPKRSGKIPPKLHNHMVHRVWKECILNRTQSKRSQMSTPTLEEEPASNPATWDFVDPTQRVSCSCSRHKLLKRCAVGPNRPPTVSQPGFSAGPSSSSSLPPPASSKHKTAERQEKGDKLQKRPLIPFHHRPSVAEELCMEQDTPGQKLGLAGIDSSLEVSSSRKYDKQMAVPSRNTSKQMNLNPMDSPHSPISPLPPTLSPQPRGQETESLDPPSVPVNPALYGNGLELQQLSTLDDRTVLVGQRLPLMAEVSETALYCGIRPSNPESSEKWWHSYRLPPSDDAEFRPPELQGERCDAKMEVNSESTALQRLLAQPNKRFKIWQDKQPQLQPLHFLDPLPLSQQPGDSLGEVNDPYTFEDGDIKYIFTANKKCKQGTEKDSLKKNKSEDGFGTKDVTTPGHSTPVPDGKNAMSIFSSATKTDVRQDNAAGRAGSSSLTQVTDLAPSLHDLDNIFDNSDDDELGAVSPALRSSKMPAVGTEDRPLGKDGRAAVPYPPTVADLQRMFPTPPSLEQHPAFSPVMNYKDGISSETVTALGMMESPMVSMVSTQLTEFKMEVEDGLGSPKPEEIKDFSYVHKVPSFQPFVGSSMFAPLKMLPSHCLLPLKIPDACLFRPSWAIPPKIEQLPMPPAATFIRDGYNNVPSVGSLADPDYLNTPQMNTPVTLNSAAPASNSGAGVLPSPATPRFSVPTPRTPRTPRTPRGGGTASGQGSVKYDSTDQGSPASTPSTTRPLNSVEPATMQPIPEAHSLYVTLILSDSVMNIFKDRNFDSCCICACNMNIKGADVGLYIPDSSNEDQYRCTCGFSAIMNRKLGYNSGLFLEDELDIFGKNSDIGQAAERRLMMCQSTFLPQVEGTKKPQEPPISLLLLLQNQHTQPFASLNFLDYISSNNRQTLPCVSWSYDRVQADNNDYWTECFNALEQGRQYVDNPTGGKVDEALVRSATVHSWPHSNVLDISMLSSQDVVRMLLSLQPFLQDAIQKKRTGRTWENIQHVQGPLTWQQFHKMAGRGTYGSEESPEPLPIPTLLVGYDKDFLTISPFSLPFWERLLLDPYGGHRDVAYIVVCPENEALLEGAKTFFRDLSAVYEMCRLGQHKPICKVLRDGIMRVGKTVAQKLTDELVSEWFNQPWSGEENDNHSRLKLYAQVCRHHLAPYLATLQLDSSLLIPPKYQTPPAAAQGQATPGNAGPLAPNGSAAPPAGSAFNPTSNSSSTNPAASSSASGSSVPPVSSSASAPGISQISTTSSSGFSGSVGGQNPSTGGISADRTQGNIGCGGDTDPGQSSSQPSQDGQESVTERERIGIPTEPDSADSHAHPPAVVIYMVDPFTYAAEEDSTSGNFWLLSLMRCYTEMLDNLPEHMRNSFILQIVPCQYMLQTMKDEQVFYIQYLKSMAFSVYCQCRRPLPTQIHIKSLTGFGPAASIEMTLKNPERPSPIQLYSPPFILAPIKDKQTELGETFGEASQKYNVLFVGYCLSHDQRWLLASCTDLHGELLETCVVNIALPNRDPFPFPISLFVRSRRSKVSARKIGLQKLWEWCIGIVQMTSLPWRVVIGRLGRLGHGELKDWSILLGECSLQTISKKLKDVCRMCGISAADSPSILSACLVAMEPQGSFVVMPDAVTMGSVFGRSTALNMQSSQLNTPQDASCTHILVFPTSSTIQVAPANYPNEDGFSPNNDDMFVDLPFPDDMDNDIGILMTGNLHSSPNSSPVPSPGSPSGIGVGSHFQHSRSQGERLLSREAPEELKQQPLALGYFVSTAKAENLPQWFWSSCPQAQNQCPLFLKASLHHHISVAQTDELLPARNSQRVPHPLDSKTTSDVLRFVLEQYNALSWLTCNPATQDRTSCLPVHFVVLTQLYNAIMNIL,,,,,,,
,4,N,Colorectal cancer,MED13L,MED13L,795,VRQDNAAGRAGSSSLTQVTDLAPSL,S,c.G2384A,VRQDNAAGRAGSNSLTQVTDLAPSL,N,25,A,A*24:01,,DSs,TMG,VRQDNAAGRAGSNSLTQVTDLAPSL,TILs,ELISPOT,4196,30709841,Cancer Immunol Res,Immunologic Recognition of a Shared p53 Mutated Neoantigen in a Patient with Metastatic Colorectal Cancer,2019,,,,,1,783,13,1,0,"""VRQDNAAGRAGSSSLTQVTDLAPSL	||||||||||||.||||||||||||	VRQDNAAGRAGSNSLTQVTDLAPSL""",MTAAANWVANGASLEDCHSNLFSLAELTGIKWRRYNFGGHGDCGPIISAPAQDDPILLSFIRCLQANLLCVWRRDVKPDCKELWIFWWGDEPNLVGVIHHELQVVEEGLWENGLSYECRTLLFKAIHNLLERCLMDKNFVRIGKWFVRPYEKDEKPVNKSEHLSCAFTFFLHGESNVCTSVEIAQHQPIYLINEEHIHMAQSSPAPFQVLVSPYGLNGTLTGQAYKMSDPATRKLIEEWQYFYPMVLKKKEESKEEDELGYDDDFPVAVEVIVGGVRMVYPSAFVLISQNDIPVPQSVASAGGHIAVGQQGLGSVKDPSNCGMPLTPPTSPEQAILGESGGMQSAASHLVSQDGGMITMHSPKRSGKIPPKLHNHMVHRVWKECILNRTQSKRSQMSTPTLEEEPASNPATWDFVDPTQRVSCSCSRHKLLKRCAVGPNRPPTVSQPGFSAGPSSSSSLPPPASSKHKTAERQEKGDKLQKRPLIPFHHRPSVAEELCMEQDTPGQKLGLAGIDSSLEVSSSRKYDKQMAVPSRNTSKQMNLNPMDSPHSPISPLPPTLSPQPRGQETESLDPPSVPVNPALYGNGLELQQLSTLDDRTVLVGQRLPLMAEVSETALYCGIRPSNPESSEKWWHSYRLPPSDDAEFRPPELQGERCDAKMEVNSESTALQRLLAQPNKRFKIWQDKQPQLQPLHFLDPLPLSQQPGDSLGEVNDPYTFEDGDIKYIFTANKKCKQGTEKDSLKKNKSEDGFGTKDVTTPGHSTPVPDGKNAMSIFSSATKTDVRQDNAAGRAGSSSLTQVTDLAPSLHDLDNIFDNSDDDELGAVSPALRSSKMPAVGTEDRPLGKDGRAAVPYPPTVADLQRMFPTPPSLEQHPAFSPVMNYKDGISSETVTALGMMESPMVSMVSTQLTEFKMEVEDGLGSPKPEEIKDFSYVHKVPSFQPFVGSSMFAPLKMLPSHCLLPLKIPDACLFRPSWAIPPKIEQLPMPPAATFIRDGYNNVPSVGSLADPDYLNTPQMNTPVTLNSAAPASNSGAGVLPSPATPRFSVPTPRTPRTPRTPRGGGTASGQGSVKYDSTDQGSPASTPSTTRPLNSVEPATMQPIPEAHSLYVTLILSDSVMNIFKDRNFDSCCICACNMNIKGADVGLYIPDSSNEDQYRCTCGFSAIMNRKLGYNSGLFLEDELDIFGKNSDIGQAAERRLMMCQSTFLPQVEGTKKPQEPPISLLLLLQNQHTQPFASLNFLDYISSNNRQTLPCVSWSYDRVQADNNDYWTECFNALEQGRQYVDNPTGGKVDEALVRSATVHSWPHSNVLDISMLSSQDVVRMLLSLQPFLQDAIQKKRTGRTWENIQHVQGPLTWQQFHKMAGRGTYGSEESPEPLPIPTLLVGYDKDFLTISPFSLPFWERLLLDPYGGHRDVAYIVVCPENEALLEGAKTFFRDLSAVYEMCRLGQHKPICKVLRDGIMRVGKTVAQKLTDELVSEWFNQPWSGEENDNHSRLKLYAQVCRHHLAPYLATLQLDSSLLIPPKYQTPPAAAQGQATPGNAGPLAPNGSAAPPAGSAFNPTSNSSSTNPAASSSASGSSVPPVSSSASAPGISQISTTSSSGFSGSVGGQNPSTGGISADRTQGNIGCGGDTDPGQSSSQPSQDGQESVTERERIGIPTEPDSADSHAHPPAVVIYMVDPFTYAAEEDSTSGNFWLLSLMRCYTEMLDNLPEHMRNSFILQIVPCQYMLQTMKDEQVFYIQYLKSMAFSVYCQCRRPLPTQIHIKSLTGFGPAASIEMTLKNPERPSPIQLYSPPFILAPIKDKQTELGETFGEASQKYNVLFVGYCLSHDQRWLLASCTDLHGELLETCVVNIALPNRDPFPFPISLFVRSRRSKVSARKIGLQKLWEWCIGIVQMTSLPWRVVIGRLGRLGHGELKDWSILLGECSLQTISKKLKDVCRMCGISAADSPSILSACLVAMEPQGSFVVMPDAVTMGSVFGRSTALNMQSSQLNTPQDASCTHILVFPTSSTIQVAPANYPNEDGFSPNNDDMFVDLPFPDDMDNDIGILMTGNLHSSPNSSPVPSPGSPSGIGVGSHFQHSRSQGERLLSREAPEELKQQPLALGYFVSTAKAENLPQWFWSSCPQAQNQCPLFLKASLHHHISVAQTDELLPARNSQRVPHPLDSKTTSDVLRFVLEQYNALSWLTCNPATQDRTSCLPVHFVVLTQLYNAIMNIL,,,,,,,
,5,N,Endometrial cancer,KRAS,KRAS,12,VVGAGGVGK,G,,VVGACGVGK,C,9,C,C*03:03,,DSs,peptide,VVGACGVGK,PBMCs,ELISPOT,A005,30835255,J Clin Invest,Neoantigen identification strategies enable personalized immunotherapy in refractory solid tumors,2019,,N,N,N,1,8,5,1,0,"""VVGAGGVGK	||||.||||	VVGACGVGK""",MTEYKLVVVGAGGVGKSALTIQLIQNHFVDEYDPTIEDSYRKQVVIDGETCLLDILDTAGQEEYSAMRDQYMRTGEGFLCVFAINNTKSFEDIHHYREQIKRVKDSEDVPMVLVGNKCDLPSRTVDTKQAQDLARSYGIPFIETSAKTRQRVEDAFYTLVREIRQYRLKKISKEEKTPGCVKIKKCIIM,,,,,,,
,6,N,Endometrial cancer,KRAS,KRAS,12,VVGAGGVGK,G,,VVGACGVGK,C,9,DR,,DRB1*09:01,DSs,peptide,VVGACGVGK,PBMCs,ELISPOT,A005,30835255,J Clin Invest,Neoantigen identification strategies enable personalized immunotherapy in refractory solid tumors,2019,,N,N,N,1,8,5,1,0,"""VVGAGGVGK	||||.||||	VVGACGVGK""",MTEYKLVVVGAGGVGKSALTIQLIQNHFVDEYDPTIEDSYRKQVVIDGETCLLDILDTAGQEEYSAMRDQYMRTGEGFLCVFAINNTKSFEDIHHYREQIKRVKDSEDVPMVLVGNKCDLPSRTVDTKQAQDLARSYGIPFIETSAKTRQRVEDAFYTLVREIRQYRLKKISKEEKTPGCVKIKKCIIM,,,,,,,
,7,N,Endometrial cancer,KRAS,KRAS,12,VVGAGGVGK,G,,VVGACGVGK,C,9,A,A*24:02,,DSs,peptide,VVGACGVGK,PBMCs,ELISPOT,A005,30835255,J Clin Invest,Neoantigen identification strategies enable personalized immunotherapy in refractory solid tumors,2019,,N,N,N,1,8,5,1,0,"""VVGAGGVGK	||||.||||	VVGACGVGK""",MTEYKLVVVGAGGVGKSALTIQLIQNHFVDEYDPTIEDSYRKQVVIDGETCLLDILDTAGQEEYSAMRDQYMRTGEGFLCVFAINNTKSFEDIHHYREQIKRVKDSEDVPMVLVGNKCDLPSRTVDTKQAQDLARSYGIPFIETSAKTRQRVEDAFYTLVREIRQYRLKKISKEEKTPGCVKIKKCIIM,,,,,,,
,8,N,Endometrial cancer,KRAS,KRAS,12,VVGAGGVGK,G,,VVGACGVGK,C,9,C,C*07:02,,DSs,peptide,VVGACGVGK,PBMCs,ELISPOT,A005,30835255,J Clin Invest,Neoantigen identification strategies enable personalized immunotherapy in refractory solid tumors,2019,,N,N,N,1,8,5,1,0,"""VVGAGGVGK	||||.||||	VVGACGVGK""",MTEYKLVVVGAGGVGKSALTIQLIQNHFVDEYDPTIEDSYRKQVVIDGETCLLDILDTAGQEEYSAMRDQYMRTGEGFLCVFAINNTKSFEDIHHYREQIKRVKDSEDVPMVLVGNKCDLPSRTVDTKQAQDLARSYGIPFIETSAKTRQRVEDAFYTLVREIRQYRLKKISKEEKTPGCVKIKKCIIM,,,,,,,
,9,N,Endometrial cancer,KRAS,KRAS,12,VVGAGGVGK,G,,VVGACGVGK,C,9,DQ,,DQB1*03:03,DSs,peptide,VVGACGVGK,PBMCs,ELISPOT,A005,30835255,J Clin Invest,Neoantigen identification strategies enable personalized immunotherapy in refractory solid tumors,2019,,N,N,N,1,8,5,1,0,"""VVGAGGVGK	||||.||||	VVGACGVGK""",MTEYKLVVVGAGGVGKSALTIQLIQNHFVDEYDPTIEDSYRKQVVIDGETCLLDILDTAGQEEYSAMRDQYMRTGEGFLCVFAINNTKSFEDIHHYREQIKRVKDSEDVPMVLVGNKCDLPSRTVDTKQAQDLARSYGIPFIETSAKTRQRVEDAFYTLVREIRQYRLKKISKEEKTPGCVKIKKCIIM,,,,,,,
,10,N,Endometrial cancer,KRAS,KRAS,12,VVGAGGVGK,G,,VVGACGVGK,C,9,B,B*40:01,,DSs,peptide,VVGACGVGK,PBMCs,ELISPOT,A005,30835255,J Clin Invest,Neoantigen identification strategies enable personalized immunotherapy in refractory solid tumors,2019,,N,N,N,1,8,5,1,0,"""VVGAGGVGK	||||.||||	VVGACGVGK""",MTEYKLVVVGAGGVGKSALTIQLIQNHFVDEYDPTIEDSYRKQVVIDGETCLLDILDTAGQEEYSAMRDQYMRTGEGFLCVFAINNTKSFEDIHHYREQIKRVKDSEDVPMVLVGNKCDLPSRTVDTKQAQDLARSYGIPFIETSAKTRQRVEDAFYTLVREIRQYRLKKISKEEKTPGCVKIKKCIIM,,,,,,,
,11,N,Endometrial cancer,KRAS,KRAS,12,VVGAGGVGK,G,,VVGACGVGK,C,9,DQ,,DQB1*04:01,DSs,peptide,VVGACGVGK,PBMCs,ELISPOT,A005,30835255,J Clin Invest,Neoantigen identification strategies enable personalized immunotherapy in refractory solid tumors,2019,,N,N,N,1,8,5,1,0,"""VVGAGGVGK	||||.||||	VVGACGVGK""",MTEYKLVVVGAGGVGKSALTIQLIQNHFVDEYDPTIEDSYRKQVVIDGETCLLDILDTAGQEEYSAMRDQYMRTGEGFLCVFAINNTKSFEDIHHYREQIKRVKDSEDVPMVLVGNKCDLPSRTVDTKQAQDLARSYGIPFIETSAKTRQRVEDAFYTLVREIRQYRLKKISKEEKTPGCVKIKKCIIM,,,,,,,
,12,N,Endometrial cancer,KRAS,KRAS,12,VVGAGGVGK,G,,VVGACGVGK,C,9,B,B*40:02,,DSs,peptide,VVGACGVGK,PBMCs,ELISPOT,A005,30835255,J Clin Invest,Neoantigen identification strategies enable personalized immunotherapy in refractory solid tumors,2019,,N,N,N,1,8,5,1,0,"""VVGAGGVGK	||||.||||	VVGACGVGK""",MTEYKLVVVGAGGVGKSALTIQLIQNHFVDEYDPTIEDSYRKQVVIDGETCLLDILDTAGQEEYSAMRDQYMRTGEGFLCVFAINNTKSFEDIHHYREQIKRVKDSEDVPMVLVGNKCDLPSRTVDTKQAQDLARSYGIPFIETSAKTRQRVEDAFYTLVREIRQYRLKKISKEEKTPGCVKIKKCIIM,,,,,,,
,13,N,Endometrial cancer,KRAS,KRAS,12,VVGAGGVGK,G,,VVGACGVGK,C,9,DR,,DRB1*04:05,DSs,peptide,VVGACGVGK,PBMCs,ELISPOT,A005,30835255,J Clin Invest,Neoantigen identification strategies enable personalized immunotherapy in refractory solid tumors,2019,,N,N,N,1,8,5,1,0,"""VVGAGGVGK	||||.||||	VVGACGVGK""",MTEYKLVVVGAGGVGKSALTIQLIQNHFVDEYDPTIEDSYRKQVVIDGETCLLDILDTAGQEEYSAMRDQYMRTGEGFLCVFAINNTKSFEDIHHYREQIKRVKDSEDVPMVLVGNKCDLPSRTVDTKQAQDLARSYGIPFIETSAKTRQRVEDAFYTLVREIRQYRLKKISKEEKTPGCVKIKKCIIM,,,,,,,
,14,N,Pancreatic cancer,KRAS,KRAS,12,KLVVVGAGGV,G,,KLVVVGAVGV,V,10,DR,,DRB1*08:02,DSs,peptide,KLVVVGAVGV,PBMCs,Cytometric Bead Array,A011,30835255,J Clin Invest,Neoantigen identification strategies enable personalized immunotherapy in refractory solid tumors,2019,,N,N,N,1,5,8,1,0,"""KLVVVGAGGV	|||||||.||	KLVVVGAVGV""",MTEYKLVVVGAGGVGKSALTIQLIQNHFVDEYDPTIEDSYRKQVVIDGETCLLDILDTAGQEEYSAMRDQYMRTGEGFLCVFAINNTKSFEDIHHYREQIKRVKDSEDVPMVLVGNKCDLPSRTVDTKQAQDLARSYGIPFIETSAKTRQRVEDAFYTLVREIRQYRLKKISKEEKTPGCVKIKKCIIM,,,,,,,
,15,N,Pancreatic cancer,KRAS,KRAS,12,KLVVVGAGGV,G,,KLVVVGAVGV,V,10,DR,,DRB1*12:02,DSs,peptide,KLVVVGAVGV,PBMCs,Cytometric Bead Array,A011,30835255,J Clin Invest,Neoantigen identification strategies enable personalized immunotherapy in refractory solid tumors,2019,,N,N,N,1,5,8,1,0,"""KLVVVGAGGV	|||||||.||	KLVVVGAVGV""",MTEYKLVVVGAGGVGKSALTIQLIQNHFVDEYDPTIEDSYRKQVVIDGETCLLDILDTAGQEEYSAMRDQYMRTGEGFLCVFAINNTKSFEDIHHYREQIKRVKDSEDVPMVLVGNKCDLPSRTVDTKQAQDLARSYGIPFIETSAKTRQRVEDAFYTLVREIRQYRLKKISKEEKTPGCVKIKKCIIM,,,,,,,
,16,N,Pancreatic cancer,KRAS,KRAS,12,KLVVVGAGGV,G,,KLVVVGAVGV,V,10,C,C*07:02,,DSs,peptide,KLVVVGAVGV,PBMCs,Cytometric Bead Array,A011,30835255,J Clin Invest,Neoantigen identification strategies enable personalized immunotherapy in refractory solid tumors,2019,,N,N,N,1,5,8,1,0,"""KLVVVGAGGV	|||||||.||	KLVVVGAVGV""",MTEYKLVVVGAGGVGKSALTIQLIQNHFVDEYDPTIEDSYRKQVVIDGETCLLDILDTAGQEEYSAMRDQYMRTGEGFLCVFAINNTKSFEDIHHYREQIKRVKDSEDVPMVLVGNKCDLPSRTVDTKQAQDLARSYGIPFIETSAKTRQRVEDAFYTLVREIRQYRLKKISKEEKTPGCVKIKKCIIM,,,,,,,
,17,N,Pancreatic cancer,KRAS,KRAS,12,KLVVVGAGGV,G,,KLVVVGAVGV,V,10,B,B*40:01,,DSs,peptide,KLVVVGAVGV,PBMCs,Cytometric Bead Array,A011,30835255,J Clin Invest,Neoantigen identification strategies enable personalized immunotherapy in refractory solid tumors,2019,,N,N,N,1,5,8,1,0,"""KLVVVGAGGV	|||||||.||	KLVVVGAVGV""",MTEYKLVVVGAGGVGKSALTIQLIQNHFVDEYDPTIEDSYRKQVVIDGETCLLDILDTAGQEEYSAMRDQYMRTGEGFLCVFAINNTKSFEDIHHYREQIKRVKDSEDVPMVLVGNKCDLPSRTVDTKQAQDLARSYGIPFIETSAKTRQRVEDAFYTLVREIRQYRLKKISKEEKTPGCVKIKKCIIM,,,,,,,
,18,N,Pancreatic cancer,KRAS,KRAS,12,KLVVVGAGGV,G,,KLVVVGAVGV,V,10,B,B*57:01,,DSs,peptide,KLVVVGAVGV,PBMCs,Cytometric Bead Array,A011,30835255,J Clin Invest,Neoantigen identification strategies enable personalized immunotherapy in refractory solid tumors,2019,,N,N,N,1,5,8,1,0,"""KLVVVGAGGV	|||||||.||	KLVVVGAVGV""",MTEYKLVVVGAGGVGKSALTIQLIQNHFVDEYDPTIEDSYRKQVVIDGETCLLDILDTAGQEEYSAMRDQYMRTGEGFLCVFAINNTKSFEDIHHYREQIKRVKDSEDVPMVLVGNKCDLPSRTVDTKQAQDLARSYGIPFIETSAKTRQRVEDAFYTLVREIRQYRLKKISKEEKTPGCVKIKKCIIM,,,,,,,
,19,N,Pancreatic cancer,KRAS,KRAS,12,KLVVVGAGGV,G,,KLVVVGAVGV,V,10,C,C*06:02,,DSs,peptide,KLVVVGAVGV,PBMCs,Cytometric Bead Array,A011,30835255,J Clin Invest,Neoantigen identification strategies enable personalized immunotherapy in refractory solid tumors,2019,,N,N,N,1,5,8,1,0,"""KLVVVGAGGV	|||||||.||	KLVVVGAVGV""",MTEYKLVVVGAGGVGKSALTIQLIQNHFVDEYDPTIEDSYRKQVVIDGETCLLDILDTAGQEEYSAMRDQYMRTGEGFLCVFAINNTKSFEDIHHYREQIKRVKDSEDVPMVLVGNKCDLPSRTVDTKQAQDLARSYGIPFIETSAKTRQRVEDAFYTLVREIRQYRLKKISKEEKTPGCVKIKKCIIM,,,,,,,
,20,N,Pancreatic cancer,KRAS,KRAS,12,KLVVVGAGGV,G,,KLVVVGAVGV,V,10,A,A*01:01,,DSs,peptide,KLVVVGAVGV,PBMCs,Cytometric Bead Array,A011,30835255,J Clin Invest,Neoantigen identification strategies enable personalized immunotherapy in refractory solid tumors,2019,,N,N,N,1,5,8,1,0,"""KLVVVGAGGV	|||||||.||	KLVVVGAVGV""",MTEYKLVVVGAGGVGKSALTIQLIQNHFVDEYDPTIEDSYRKQVVIDGETCLLDILDTAGQEEYSAMRDQYMRTGEGFLCVFAINNTKSFEDIHHYREQIKRVKDSEDVPMVLVGNKCDLPSRTVDTKQAQDLARSYGIPFIETSAKTRQRVEDAFYTLVREIRQYRLKKISKEEKTPGCVKIKKCIIM,,,,,,,
,21,P,Pancreatic cancer,KRAS,KRAS,12,VVGAGGVGK,G,,VVGADGVGK,D,9,A,A*11:01,,DSs,peptide,VVGADGVGK,PBMCs,ELISPOT,A020,30835255,J Clin Invest,Neoantigen identification strategies enable personalized immunotherapy in refractory solid tumors,2019,,Y,N,N,1,8,5,1,0,"""VVGAGGVGK	||||.||||	VVGADGVGK""",MTEYKLVVVGAGGVGKSALTIQLIQNHFVDEYDPTIEDSYRKQVVIDGETCLLDILDTAGQEEYSAMRDQYMRTGEGFLCVFAINNTKSFEDIHHYREQIKRVKDSEDVPMVLVGNKCDLPSRTVDTKQAQDLARSYGIPFIETSAKTRQRVEDAFYTLVREIRQYRLKKISKEEKTPGCVKIKKCIIM,,,,,,,
,22,P,Endometrial cancer,KRAS,KRAS,12,VVGAGGVGK,G,,VVGACGVGK,C,9,A,A*11:01,,DSs,peptide,VVGACGVGK,PBMCs,ELISPOT,A005,30835255,J Clin Invest,Neoantigen identification strategies enable personalized immunotherapy in refractory solid tumors,2019,,Y,N,N,1,8,5,1,0,"""VVGAGGVGK	||||.||||	VVGACGVGK""",MTEYKLVVVGAGGVGKSALTIQLIQNHFVDEYDPTIEDSYRKQVVIDGETCLLDILDTAGQEEYSAMRDQYMRTGEGFLCVFAINNTKSFEDIHHYREQIKRVKDSEDVPMVLVGNKCDLPSRTVDTKQAQDLARSYGIPFIETSAKTRQRVEDAFYTLVREIRQYRLKKISKEEKTPGCVKIKKCIIM,,,,,,,
,23,P,Pancreatic cancer,KRAS,KRAS,12,KLVVVGAGGV,G,,KLVVVGAVGV,V,10,A,A*02:01,,DSs,peptide,KLVVVGAVGV,PBMCs,Cytometric Bead Array,A011,30835255,J Clin Invest,Neoantigen identification strategies enable personalized immunotherapy in refractory solid tumors,2019,,Y,N,N,1,5,8,1,0,"""KLVVVGAGGV	|||||||.||	KLVVVGAVGV""",MTEYKLVVVGAGGVGKSALTIQLIQNHFVDEYDPTIEDSYRKQVVIDGETCLLDILDTAGQEEYSAMRDQYMRTGEGFLCVFAINNTKSFEDIHHYREQIKRVKDSEDVPMVLVGNKCDLPSRTVDTKQAQDLARSYGIPFIETSAKTRQRVEDAFYTLVREIRQYRLKKISKEEKTPGCVKIKKCIIM,,,,,,,
,24,P,Lung cancer,KRAS,KRAS,12,VVGAGGVGK,G,,VVGAAGVGK,A,9,A,A*11:01,,DSs,peptide,VVGAAGVGK,PBMCs,Cytometric Bead Array,A018,30835255,J Clin Invest,Neoantigen identification strategies enable personalized immunotherapy in refractory solid tumors,2019,,Y,N,N,1,8,5,1,0,"""VVGAGGVGK	||||.||||	VVGAAGVGK""",MTEYKLVVVGAGGVGKSALTIQLIQNHFVDEYDPTIEDSYRKQVVIDGETCLLDILDTAGQEEYSAMRDQYMRTGEGFLCVFAINNTKSFEDIHHYREQIKRVKDSEDVPMVLVGNKCDLPSRTVDTKQAQDLARSYGIPFIETSAKTRQRVEDAFYTLVREIRQYRLKKISKEEKTPGCVKIKKCIIM,,,,,,,
,25,P,Pancreatic cancer,KRAS,KRAS,12,VVGAGGVGK,G,,VVGAVGVGK,V,9,A,A*11:01,,DSs,peptide,VVGAVGVGK,PBMCs,Cytometric Bead Array,C002,30835255,J Clin Invest,Neoantigen identification strategies enable personalized immunotherapy in refractory solid tumors,2019,,Y,N,N,1,8,5,1,0,"""VVGAGGVGK	||||.||||	VVGAVGVGK""",MTEYKLVVVGAGGVGKSALTIQLIQNHFVDEYDPTIEDSYRKQVVIDGETCLLDILDTAGQEEYSAMRDQYMRTGEGFLCVFAINNTKSFEDIHHYREQIKRVKDSEDVPMVLVGNKCDLPSRTVDTKQAQDLARSYGIPFIETSAKTRQRVEDAFYTLVREIRQYRLKKISKEEKTPGCVKIKKCIIM,,,,,,,
,26,P,Pancreatic cancer,KRAS,KRAS,12,KLVVVGAGGV,G,,KLVVVGADGV,D,10,A,A*02:01,,DSs,peptide,KLVVVGADGV,PBMCs,Cytometric Bead Array,C003,30835255,J Clin Invest,Neoantigen identification strategies enable personalized immunotherapy in refractory solid tumors,2019,,Y,N,N,1,5,8,1,0,"""KLVVVGAGGV	|||||||.||	KLVVVGADGV""",MTEYKLVVVGAGGVGKSALTIQLIQNHFVDEYDPTIEDSYRKQVVIDGETCLLDILDTAGQEEYSAMRDQYMRTGEGFLCVFAINNTKSFEDIHHYREQIKRVKDSEDVPMVLVGNKCDLPSRTVDTKQAQDLARSYGIPFIETSAKTRQRVEDAFYTLVREIRQYRLKKISKEEKTPGCVKIKKCIIM,,,,,,,
,27,N,Colorectal cancer,KMT2D,KMT2D,1663,LKGEGGVEHMECEIKLEGPVSPDVE,E,c.G4987A,LKGEGGVEHMECKIKLEGPVSPDVE,K,25,A,A*02:01,,DSs,TMG,LKGEGGVEHMECKIKLEGPVSPDVE,TILs,ELISPOT,4196,30709841,Cancer Immunol Res,Immunologic Recognition of a Shared p53 Mutated Neoantigen in a Patient with Metastatic Colorectal Cancer,2019,,,,,1,1651,13,1,0,"""LKGEGGVEHMECEIKLEGPVSPDVE	||||||||||||.||||||||||||	LKGEGGVEHMECKIKLEGPVSPDVE""",MDSQKLAGEDKDSEPAADGPAASEDPSATESDLPNPHVGEVSVLSSGSPRLQETPQDCSGGPVRRCALCNCGEPSLHGQRELRRFELPFDWPRCPVVSPGGSPGPNEAVLPSEDLSQIGFPEGLTPAHLGEPGGSCWAHHWCAAWSAGVWGQEGPELCGVDKAIFSGISQRCSHCTRLGASIPCRSPGCPRLYHFPCATASGSFLSMKTLQLLCPEHSEGAAYLEEARCAVCEGPGELCDLFFCTSCGHHYHGACLDTALTARKRAGWQCPECKVCQACRKPGNDSKMLVCETCDKGYHTFCLKPPMEELPAHSWKCKACRVCRACGAGSAELNPNSEWFENYSLCHRCHKAQGGQTIRSVAEQHTPVCSRFSPPEPGDTPTDEPDALYVACQGQPKGGHVTSMQPKEPGPLQCEAKPLGKAGVQLEPQLEAPLNEEMPLLPPPEESPLSPPPEESPTSPPPEASRLSPPPEELPASPLPEALHLSRPLEESPLSPPPEESPLSPPPESSPFSPLEESPLSPPEESPPSPALETPLSPPPEASPLSPPFEESPLSPPPEELPTSPPPEASRLSPPPEESPMSPPPEESPMSPPPEASRLFPPFEESPLSPPPEESPLSPPPEASRLSPPPEDSPMSPPPEESPMSPPPEVSRLSPLPVVSRLSPPPEESPLSPPPEESPTSPPPEASRLSPPPEDSPTSPPPEDSPASPPPEDSLMSLPLEESPLLPLPEEPQLCPRSEGPHLSPRPEEPHLSPRPEEPHLSPQAEEPHLSPQPEEPCLCAVPEEPHLSPQAEGPHLSPQPEELHLSPQTEEPHLSPVPEEPCLSPQPEESHLSPQSEEPCLSPRPEESHLSPELEKPPLSPRPEKPPEEPGQCPAPEELPLFPPPGEPSLSPLLGEPALSEPGEPPLSPLPEELPLSPSGEPSLSPQLMPPDPLPPPLSPIITAAAPPALSPLGELEYPFGAKGDSDPESPLAAPILETPISPPPEANCTDPEPVPPMILPPSPGSPVGPASPILMEPLPPQCSPLLQHSLVPQNSPPSQCSPPALPLSVPSPLSPIGKVVGVSDEAELHEMETEKVSEPECPALEPSATSPLPSPMGDLSCPAPSPAPALDDFSGLGEDTAPLDGIDAPGSQPEPGQTPGSLASELKGSPVLLDPEELAPVTPMEVYPECKQTAGQGSPCEEQEEPRAPVAPTPPTLIKSDIVNEISNLSQGDASASFPGSEPLLGSPDPEGGGSLSMELGVSTDVSPARDEGSLRLCTDSLPETDDSLLCDAGTAISGGKAEGEKGRRRSSPARSRIKQGRSSSFPGRRRPRGGAHGGRGRGRARLKSTASSIETLVVADIDSSPSKEEEEEDDDTMQNTVVLFSNTDKFVLMQDMCVVCGSFGRGAEGHLLACSQCSQCYHPYCVNSKITKVMLLKGWRCVECIVCEVCGQASDPSRLLLCDDCDISYHTYCLDPPLLTVPKGGWKCKWCVSCMQCGAASPGFHCEWQNSYTHCGPCASLVTCPICHAPYVEEDLLIQCRHCERWMHAGCESLFTEDDVEQAADEGFDCVSCQPYVVKPVAPVAPPELVPMKVKEPEPQYFRFEGVWLTETGMALLRNLTMSPLHKRRQRRGRLGLPGEAGLEGSEPSDALGPDDKKDGDLDTDELLKGEGGVEHMECEIKLEGPVSPDVEPGKEETEESKKRKRKPYRPGIGGFMVRQRKSHTRTKKGPAAQAEVLSGDGQPDEGETVIPADLPAEGAVEQSLAEGDEKKKQQRRGRKKSKLEDMFPAYLQEAFFGKELLDLSRKALFAVGVGRPSFGLGTPKAKGDGGSERKELPTSQKGDDGPDIADEESRGLEGKADTPGPEDGGVKASPVPSDPEKPGTPGEGMLSSDLDRISTEELPKMESKDLQQLFKDVLGSEREQHLGCGTPGLEGSRTPLQRPFLQGGLPLGNLPSSSPMDSYPGLCQSPFLDSRERGGFFSPEPGEPDSPWTGSGGTTPSTPTTPTTEGEGDGLSYNQRSLQRWEKDEELGQLSTISPVLYANINFPNLKQDYPDWSSRCKQIMKLWRKVPAADKAPYLQKAKDNRAAHRINKVQKQAESQINKQTKVGDIARKTDRPALHLRIPPQPGALGSPPPAAAPTIFIGSPTTPAGLSTSADGFLKPPAGSVPGPDSPGELFLKLPPQVPAQVPSQDPFGLAPAYPLEPRFPTAPPTYPPYPSPTGAPAQPPMLGASSRPGAGQPGEFHTTPPGTPRHQPSTPDPFLKPRCPSLDNLAVPESPGVGGGKASEPLLSPPPFGESRKALEVKKEELGASSPSYGPPNLGFVDSPSSGTHLGGLELKTPDVFKAPLTPRASQVEPQSPGLGLRPQEPPPAQALAPSPPSHPDIFRPGSYTDPYAQPPLTPRPQPPPPESCCALPPRSLPSDPFSRVPASPQSQSSSQSPLTPRPLSAEAFCPSPVTPRFQSPDPYSRPPSRPQSRDPFAPLHKPPRPQPPEVAFKAGSLAHTSLGAGGFPAALPAGPAGELHAKVPSGQPPNFVRSPGTGAFVGTPSPMRFTFPQAVGEPSLKPPVPQPGLPPPHGINSHFGPGPTLGKPQSTNYTVATGNFHPSGSPLGPSSGSTGESYGLSPLRPPSVLPPPAPDGSLPYLSHGASQRSGITSPVEKREDPGTGMGSSLATAELPGTQDPGMSGLSQTELEKQRQRQRLRELLIRQQIQRNTLRQEKETAAAAAGAVGPPGSWGAEPSSPAFEQLSRGQTPFAGTQDKSSLVGLPPSKLSGPILGPGSFPSDDRLSRPPPPATPSSMDVNSRQLVGGSQAFYQRAPYPGSLPLQQQQQQLWQQQQATAATSMRFAMSARFPSTPGPELGRQALGSPLAGISTRLPGPGEPVPGPAGPAQFIELRHNVQKGLGPGGTPFPGQGPPQRPRFYPVSEDPHRLAPEGLRGLAVSGLPPQKPSAPPAPELNNSLHPTPHTKGPTLPTGLELVNRPPSSTELGRPNPLALEAGKLPCEDPELDDDFDAHKALEDDEELAHLGLGVDVAKGDDELGTLENLETNDPHLDDLLNGDEFDLLAYTDPELDTGDKKDIFNEHLRLVESANEKAEREALLRGVEPGPLGPEERPPPAADASEPRLASVLPEVKPKVEEGGRHPSPCQFTIATPKVEPAPAANSLGLGLKPGQSMMGSRDTRMGTGPFSSSGHTAEKASFGATGGPPAHLLTPSPLSGPGGSSLLEKFELESGALTLPGGPAASGDELDKMESSLVASELPLLIEDLLEHEKKELQKKQQLSAQLQPAQQQQQQQQQHSLLSAPGPAQAMSLPHEGSSPSLAGSQQQLSLGLAGARQPGLPQPLMPTQPPAHALQQRLAPSMAMVSNQGHMLSGQHGGQAGLVPQQSSQPVLSQKPMGTMPPSMCMKPQQLAMQQQLANSFFPDTDLDKFAAEDIIDPIAKAKMVALKGIKKVMAQGSIGVAPGMNRQQVSLLAQRLSGGPSSDLQNHVAAGSGQERSAGDPSQPRPNPPTFAQGVINEADQRQYEEWLFHTQQLLQMQLKVLEEQIGVHRKSRKALCAKQRTAKKAGREFPEADAEKLKLVTEQQSKIQKQLDQVRKQQKEHTNLMAEYRNKQQQQQQQQQQQQQQHSAVLALSPSQSPRLLTKLPGQLLPGHGLQPPQGPPGGQAGGLRLTPGGMALPGQPGGPFLNTALAQQQQQQHSGGAGSLAGPSGGFFPGNLALRSLGPDSRLLQERQLQLQQQRMQLAQKLQQQQQQQQQQQHLLGQVAIQQQQQQGPGVQTNQALGPKPQGLMPPSSHQGLLVQQLSPQPPQGPQGMLGPAQVAVLQQQHPGALGPQGPHRQVLMTQSRVLSSPQLAQQGQGLMGHRLVTAQQQQQQQQHQQQGSMAGLSHLQQSLMSHSGQPKLSAQPMGSLQQLQQQQQLQQQQQLQQQQQQQLQQQQQLQQQQLQQQQQQQQLQQQQQQQLQQQQQQLQQQQQQQQQQFQQQQQQQQMGLLNQSRTLLSPQQQQQQQVALGPGMPAKPLQHFSSPGALGPTLLLTGKEQNTVDPAVSSEATEGPSTHQGGPLAIGTTPESMATEPGEVKPSLSGDSQLLLVQPQPQPQPSSLQLQPPLRLPGQQQQQVSLLHTAGGGSHGQLGSGSSSEASSVPHLLAQPSVSLGDQPGSMTQNLLGPQQPMLERPMQNNTGPQPPKPGPVLQSGQGLPGVGIMPTVGQLRAQLQGVLAKNPQLRHLSPQQQQQLQALLMQRQLQQSQAVRQTPPYQEPGTQTSPLQGLLGCQPQLGGFPGPQTGPLQELGAGPRPQGPPRLPAPPGALSTGPVLGPVHPTPPPSSPQEPKRPSQLPSPSSQLPTEAQLPPTHPGTPKPQGPTLEPPPGRVSPAAAQLADTLFSKGLGPWDPPDNLAETQKPEQSSLVPGHLDQVNGQVVPEASQLSIKQEPREEPCALGAQSVKREANGEPIGAPGTSNHLLLAGPRSEAGHLLLQKLLRAKNVQLSTGRGSEGLRAEINGHIDSKLAGLEQKLQGTPSNKEDAAARKPLTPKPKRVQKASDRLVSSRKKLRKEDGVRASEALLKQLKQELSLLPLTEPAITANFSLFAPFGSGCPVNGQSQLRGAFGSGALPTGPDYYSQLLTKNNLSNPPTPPSSLPPTPPPSVQQKMVNGVTPSEELGEHPKDAASARDSERALRDTSEVKSLDLLAALPTPPHNQTEDVRMESDEDSDSPDSIVPASSPESILGEEAPRFPHLGSGRWEQEDRALSPVIPLIPRASIPVFPDTKPYGALGLEVPGKLPVTTWEKGKGSEVSVMLTVSAAAAKNLNGVMVAVAELLSMKIPNSYEVLFPESPARAGTEPKKGEAEGPGGKEKGLEGKSPDTGPDWLKQFDAVLPGYTLKSQLDILSLLKQESPAPEPPTQHSYTYNVSNLDVRQLSAPPPEEPSPPPSPLAPSPASPPTEPLVELPTEPLAEPPVPSPLPLASSPESARPKPRARPPEEGEDSRPPRLKKWKGVRWKRLRLLLTIQKGSGRQEDEREVAEFMEQLGTALRPDKVPRDMRRCCFCHEEGDGATDGPARLLNLDLDLWVHLNCALWSTEVYETQGGALMNVEVALHRGLLTKCSLCQRTGATSSCNRMRCPNVYHFACAIRAKCMFFKDKTMLCPMHKIKGPCEQELSSFAVFRRVYIERDEVKQIASIIQRGERLHMFRVGGLVFHAIGQLLPHQMADFHSATALYPVGYEATRIYWSLRTNNRRCCYRCSIGENNGRPEFVIKVIEQGLEDLVFTDASPQAVWNRIIEPVAAMRKEADMLRLFPEYLKGEELFGLTVHAVLRIAESLPGVESCQNYLFRYGRHPLMELPLMINPTGCARSEPKILTHYKRVFTSIISFDPHNNLMRPHTLNSTSMSKAYQSTFTGETNTPYSKQFVHSKSSQYRRLRTEWKNNVYLARSRIQGLGLYAAKDLEKHTMVIEYIGTIIRNEVANRREKIYEEQNRGIYMFRINNEHVIDATLTGGPARYINHSCAPNCVAEVVTFDKEDKIIIISSRRIPKGEELTYDYQFDFEDDQHKIPCHCGAWNCRKWMN,,,,,,,